خار فنری انگشتی پیستون
scope note: خاری فنری که در دو سر انگشتی پیستون قرار دارد و مانع از خروج انگشتی از جایگاهش می‌شود.
broader: انگشتی پیستون
preferred label: piston pin circlip @en
type: Concept

انگشتی پیستون
preferred label: piston pin @en
type: Concept
narrower: خار فنری انگشتی پیستون