لایی فلزی
preferred label: shim @en
type: Concept
narrower: لایی درز انبساط

لایی درز انبساط
scope note: نوعی فاصله‌انداز که در زمان نصب خط بین دو سر ریل‌های مجاور قرار می‌دهند تا با بالا رفتن دما فضای کافی برای انبساط ریل‌های فولادی وجود داشته باشد.
broader: لایی فلزی
preferred label: rail expansion shim @en
type: Concept