تیر طره‌ای
scope note: تیری که یک‌ سر آن گیردار و سر دیگر آن آزاد باشد.
broader: تیر
preferred label: cantilever beam @en
type: Concept

تیر
preferred label: beam @en
type: Concept
narrower: تیر طره‌ای