تیر
preferred label: beam @en
type: Concept
narrower: تیر تعادل

تیر تعادل
scope note: تیر متقاطعی که به زیر بینه‌گیرها (logstringer) اضافه میشود تا تعادل آنها را در جهت عمودی برقرار کند.
broader: تیر
preferred label: equalizer beam @en
type: Concept