تیر گیردارـ ساده
scope note: تیری که یک سر آن کاملاً گیردار و سر دیگر آن بر روی تکیه‌گاه ساده قرار گیرد.
broader: تیر
preferred label: fixed-free beam @en
type: Concept

تیر
preferred label: beam @en
type: Concept
narrower: تیر گیردارـ ساده