تیرورق
preferred label: plate girder @en
type: Concept
broader: شاه‌تیر

تیر و شاه‌تیر
preferred label: beam and girder @en
type: Concept
narrower: شاه‌تیر

شاه‌تیر
scope note: تیر اصلی که بار منتقل‌شده از تیرهای فرعی و تیرچه‌ها را به تکیه‌گاه‌ها منتقل کند.
narrower: تیرورق
broader: تیر و شاه‌تیر
preferred label: girder @en
type: Concept