پِی نواری
scope note: نوعی پِی‏ که طول آن از پهنای آن به‌مراتب بیشتر باشد.
broader: پی (شالوده)
preferred label: strip footing @en
type: Concept

پی (شالوده)
preferred label: footing @en
type: Concept
narrower: پِی نواری