اتصال (اجزای سازه‌ای)
preferred label: joint (structural components) @en
type: Concept
narrower: اتصال گوی‌سان

اتصال گوی‌سان
scope note: اتصالی با سه درجه آزادی دَورانی که لنگر را انتقال نمی‌دهد.
broader: اتصال (اجزای سازه‌ای)
preferred label: ball joint @en
type: Concept