اتصال (اجزای سازه‌ای)
preferred label: joint (structural components) @en
type: Concept
narrower: اتصال مفصلی

اتصال مفصلی
scope note: اتصالی که دَوران اعضای متصل به آن در صفحۀ خرپا آزاد باشد.
broader: اتصال (اجزای سازه‌ای)
preferred label: pin joint @en
type: Concept