جوش
preferred label: weld @en
type: Concept
narrower: جوش معیوب

جوش معیوب
scope note: عیبی ناشی از گسترش عرضی ترک در جوشکاری بین دو ریل که منشأ آن محبوس شدن هوا یا ترک ریز اولیه است.
broader: جوش
preferred label: defective weld @en
type: Concept