ورق بست
scope note: ورقی فولادی برای یکپارچه کردن دو یا چند عضو موازی
broader: ورق (اجزای سازه‌ای)
preferred label: batten plate @en
type: Concept

ورق (اجزای سازه‌ای)
preferred label: plate (structural components) @en
type: Concept
narrower: ورق بست