ورق تکیه‌گاه تیر
scope note: ورقی فلزی که در زیر سرِ تیر، در نقطۀ اتکای آن، قرار می‌دهند تا بار وارد بر آن نقطه توزیع شود.
broader: ورق (اجزای سازه‌ای)
preferred label: beam bearing plate @en
type: Concept

ورق (اجزای سازه‌ای)
preferred label: plate (structural components) @en
type: Concept
narrower: ورق تکیه‌گاه تیر