ورق تقویت
scope note: ورقی انضمامی برای افزایش مقاومت اعضای سازه‌ای
broader: ورق (اجزای سازه‌ای)
preferred label: reinforcing plate @en
type: Concept

ورق (اجزای سازه‌ای)
preferred label: plate (structural components) @en
type: Concept
narrower: ورق تقویت