ورق وصله
scope note: ورقی برای اتصال ورق‌های جان یا بال‌های شاه‌تیرها
broader: ورق (اجزای سازه‌ای)
preferred label: splice plate @en
type: Concept

ورق (اجزای سازه‌ای)
preferred label: plate (structural components) @en
type: Concept
narrower: ورق وصله