ورق سخت‌کننده
scope note: ورقی برای افزایش مقاومت و سختی تیر لاغر و جلوگیری از کمانش آن
broader: ورق (اجزای سازه‌ای)
preferred label: stiffener plate @en
type: Concept

ورق (اجزای سازه‌ای)
preferred label: plate (structural components) @en
type: Concept
narrower: ورق سخت‌کننده