لوله دوچشمی
scope note: لوله‌ای در دستگاه‌های اپتیکی که دارای دو عدد چشمی است.
broader: لوله (اجزا)
preferred label: binocular tube @en
type: Concept

لوله (اجزا)
preferred label: tube (components) @en
type: Concept
narrower: لوله دوچشمی