مفسر پرل
scope note: برنامه‌ای که گزاره‌های زبان برنامه‌نویسی پِرل را خط‌به‌خط، به‌صورت یک خط در هر مرحله، ترجمه و اجرا می‌کند.
broader: مفسر برنامه
preferred label: Perl interpreter @en
type: Concept

مفسر برنامه
preferred label: program interpreter @en
type: Concept
narrower: مفسر پرل