آنتن
preferred label: antenna @en
type: Concept
related: مخروط سکوت

مخروط
preferred label: cone @en
type: Concept
narrower: مخروط سکوت

مخروط سکوت
scope note: منطقۀ مخروطی‌شکل فضای بالای آنتن‌ها که در آن نشانک‌ها/ سیگنال‌های رادیویی ارسال‌شده ضعیف می‌شوند یا شنیده نمی‌شوند.
related: آنتن
broader: مخروط
preferred label: cone of silence @en
type: Concept