صورت‌بندی بتا
scope note: صورت‌بندی پایداری از رشتۀ پلی‌پپتیدی که در نهایت کشیدگی قرار داشته باشد.
broader: صورت‌بندی
preferred label: beta conformation @en
type: Concept

صورت‌بندی
preferred label: conformation @en
type: Concept
narrower: صورت‌بندی بتا