حفاظت باستان‌شناختی مردمی
scope note: انجام برنامه‌های حفاظتی غیرانتفاعی گروه‌های مردمی در محوطه‌ها و آثار باستانی
broader: حفاظت
preferred label: archaeological conservancy @en
type: Concept

حفاظت
preferred label: conservation @en
type: Concept
narrower: حفاظت باستان‌شناختی مردمی