دارودرمانی
preferred label: drug therapy @en
type: Concept
related: ثابت سرعت دفع

ثابت سرعت دفع
scope note: شاخص سرعت دفع دارو از بدن نسبت به کل داروی واردشده
related: دارودرمانی
broader: ثابت
preferred label: elimination rate constant @en
type: Concept

ثابت
preferred label: constant @en
type: Concept
narrower: ثابت سرعت دفع