بطری رانه‌ای
scope note: بطری یا شیئی که برای مطالعۀ جریان‌های اقیانوسی، در آب دریا رها میشود.
broader: بطری
preferred label: drift bottle @en
type: Concept

بطری
preferred label: bottle @en
type: Concept
narrower: بطری رانه‌ای