بطری
preferred label: bottle @en
type: Concept
narrower: بطری نمونه‌برداری

بطری نمونه‌برداری
scope note: بطری استوانه‌شکلی که معمولاً در عمقی خاص ورودی آن بسته می‌شود و نمونۀ آب در درون آن به دام می‌افتد و بدون تبادل با محیط اطراف به سطح آب آورده می‌شود.
broader: بطری
preferred label: sampling bottle @en
type: Concept