بارگنج روباز
scope note: بارگُنجی که سقف ندارد و برای پوشاندن آن از برزنت یا چادر استفاده می‌کنند.
broader: بارگنج
preferred label: open-top container @en
type: Concept

بارگنج
preferred label: container @en
type: Concept
narrower: بارگنج روباز