بارگنج عایق
scope note: بارگُنجی که بدون تجهیزات تولید گرما و سرما، به‌واسطۀ داشتن سقف و کف و در و دیواره‌های عایق، دمای مطلوب را حفظ می‌کند.
broader: بارگنج
preferred label: thermal container @en
type: Concept

بارگنج
preferred label: container @en
type: Concept
narrower: بارگنج عایق