بارگنج
preferred label: container @en
type: Concept
narrower: بارگنج تهویه‌ای

بارگنج تهویه‌ای
scope note: بارگُنجی که در دیواره‌های انتهایی آن روزنه‌هایی برای ورود و خروج هوا تعبیه شده است.
broader: بارگنج
preferred label: ventilated container @en
type: Concept