ظرف
preferred label: container (general) @en
type: Concept
narrower: قوطی استوانه‌ای

قوطی استوانه‌ای
alternative label: قوطی بلند
scope note: نوعی قوطی کنسرو که ارتفاع آن بیشتر از قطر آن است.
broader: ظرف
preferred label: cylinder can @en
type: Concept