ظرف
preferred label: container (general) @en
type: Concept
narrower: ظرف موج‌پز

ظرف موج‌پز
scope note: ظرفی که در برابر گرمای داخل ریزموج مقاوم است.
broader: ظرف
preferred label: microwaveable container @en
type: Concept