مخزن هضم
scope note: مخزنی که در آن لجن به‌وسیلۀ ریزاندامگان‌ها تجزیه می‌شود.
broader: مخزن
preferred label: digestion tank @en
type: Concept

مخزن
preferred label: tank (container) @en
type: Concept
narrower: مخزن هضم