حوض ته‌نشینی
preferred label: settling tank @en
type: Concept
narrower: حوض ته‌نشینی اولیه

حوض ته‌نشینی اولیه
scope note: حوضی برای ته‌نشینی مواد جامد قبل از مرحلۀ تصفیۀ ثانویه
broader: حوض ته‌نشینی
preferred label: primary sedimentation tank @en
type: Concept