حوض ته‌نشینی
preferred label: settling tank @en
type: Concept
narrower: حوض ته‌نشینی ثانویه

حوض ته‌نشینی ثانویه
scope note: حوض ته‌نشینی مربوط به مرحلۀ تصفیۀ ثانویۀ فاضلاب برای جدا کردن ریزاندامگان‌ها براساس وزن
broader: حوض ته‌نشینی
preferred label: secondary sedimentation tank @en
type: Concept