پیمان درصدی
scope note: نوعی پیمان هزینه‌ ـ‌ کارمزد که کارمزد آن درصدی از هزینه است.
broader: قرارداد
preferred label: cost-plus-percentage of cost contrat @en
type: Concept

قرارداد
preferred label: contract @en
type: Concept
narrower: پیمان درصدی