قرارداد
preferred label: contract @en
type: Concept
narrower: پیمان بازپرداخت هزینه

پیمان بازپرداخت هزینه
scope note: پیمانی که براساس آن خریدار باید هزینه‌های فروشنده را طبق توافق بپردازد.
broader: قرارداد
preferred label: cost-reimbursable contract @en
type: Concept