خوردگی جوی
scope note: تخریب تدریجی مواد در نتیجۀ تماس با عوامل موجود در جوّ، مانند اکسیژن و کربن‌دی‌اکسید و بخار آب و ترکیبات گوگرد و کلر
related: هواشناسی
broader: خوردگی
preferred label: atmospheric corrosion @en
type: Concept

هواشناسی
preferred label: meteorology @en
type: Concept
related: خوردگی جوی

خوردگی
preferred label: corrosion @en
type: Concept
narrower: خوردگی جوی