خوردگی
preferred label: corrosion @en
type: Concept
narrower: خوردگی شیمیایی

خوردگی شیمیایی
scope note: نوعی خوردگی که تحت تأثیر گازهای خشک یا در محیط مواد آلی عاری از آب که طبیعتی غیرالکتروشیمیایی دارند، ایجاد می‌شود.
broader: خوردگی
preferred label: chemical corrosion @en
type: Concept