ترک‌خوردگی محیطی
scope note: شکست تُرد ماده‌ای که به‌طور طبیعی انعطاف‌پذیر است، براثر دخالت عوامل خورندۀ محیطی
broader: خوردگی
preferred label: environmental cracking @en
type: Concept

خوردگی
preferred label: corrosion @en
type: Concept
narrower: ترک‌خوردگی محیطی