خوردگی موضعی شارشی
scope note: نوعی خوردگی شارشی که در نتیجۀ آشفتگی جریان و تغییرات سریع سرعت سیال پدید می‌آید.
broader: خوردگی شارشی
preferred label: flow-induced localized corrosion @en
type: Concept

خوردگی شارشی
preferred label: flow-induced corrosion @en
type: Concept
narrower: خوردگی موضعی شارشی