خوردگی موضعی
preferred label: localized corrosion @en
type: Concept
narrower: خوردگی لانه‌مورچه‌ای

خوردگی لانه‌مورچه‌ای
scope note: نوعی خوردگی موضعی شبیه به لانۀ مورچه که براثر کربوکسیلیکاسیدهای حاصل از آب‌کافت حلاّل‌های آلی کلردار و روغن‌های روان‌ساز به وجود می‌آید.
broader: خوردگی موضعی
preferred label: ant nest corrosion @en
type: Concept