خوردگی آهن‌نشین
scope note: نوعی خوردگی شیاری در سازه‌های فولاد زنگ‌نزن که در آن آهن غیرآلیاژی باقی‌مانده در سطح فولاد در تماس با رطوبت جو زنگ می‌زند.
broader: خوردگی شیاری
preferred label: embedded iron corrosion @en
type: Concept

خوردگی شیاری
preferred label: crevice corrosion @en
type: Concept
narrower: خوردگی آهن‌نشین