ترک‌خوردگی
preferred label: cracking @en
type: Concept
narrower: ترک‌خوردگی اریب

ترک‌خوردگی اریب
scope note: ترک‌هایی مایل یا کج در نیمۀ بالایی دیوارۀ تایر
broader: ترک‌خوردگی
preferred label: diagonal cracking @en
type: Concept