ترک‌خوردگی
preferred label: cracking @en
type: Concept
narrower: ترک‌خوردگی شعاعی

ترک‌خوردگی شعاعی
scope note: ترکی بر دیوارۀ بیرونی تایر که به‌صورت عمودی به سمت طوقه گسترش می‌یابد.
broader: ترک‌خوردگی
preferred label: radial crack @en
type: Concept