رمزنگاری
preferred label: cryptography @en
type: Concept
narrower: رمزنگاری مشبکه‌‌بنیاد

رمزنگاری مشبکه‌‌بنیاد
scope note: نوعی رمزنگاری که امنیت آن براساس سختی چند مسئلۀ دشوار در حوزۀ مشبکه‌ها استوار است.
broader: رمزنگاری
preferred label: lattice-based cryptography @en
type: Concept