رمزنگاری با کلید عمومی
alternative label: رمزنگاری نامتقارن
scope note: روشی برای رمزگذاری پیام که در آن از کلید عمومی و کلید مخفی استفاده می‌شود: کلید عمومی برای رمزگذاری و کلید مخفی برای رمزگشایی
broader: رمزنگاری
preferred label: public key cryptography @en
type: Concept

رمزنگاری
preferred label: cryptography @en
type: Concept
narrower: رمزنگاری با کلید عمومی