رمزنگاری
preferred label: cryptography @en
type: Concept
narrower: رمزنگاری کوانتومی

رمزنگاری کوانتومی
scope note: رمزنگاری با استفاده از قوانین مکانیک کوانتومی
broader: رمزنگاری
preferred label: quantum cryptography @en
type: Concept