رمزنگاری
preferred label: cryptography @en
type: Concept
narrower: رمزنگاری با کلید مخفی

رمزنگاری با کلید مخفی
alternative label: رمزنگاری متقارن
scope note: روشی برای رمزگذاری پیام که در آن برای رمزگذاری و رمزگشایی تنها از یک کلید استفاده می‌شود.
broader: رمزنگاری
preferred label: secret key cryptography @en
type: Concept