رمزنگاری آستانه‌ای پیش‌نگر
preferred label: proactive threshold cryptography @en
type: Concept
broader: رمزنگاری آستانه‌ای

رمزنگاری
preferred label: cryptography @en
type: Concept
narrower: رمزنگاری آستانه‌ای

رمزنگاری آستانه‌ای
scope note: نوعی رمزنگاری که کلید آن در میان شماری از افراد مجاز تسهیم‌ می‌شود و برای رمزگشایی، حضور حداقل مشخصی از آن افراد برای دستیابی به کلید لازم است.
narrower: رمزنگاری آستانه‌ای پیش‌نگر
broader: رمزنگاری
preferred label: threshold cryptography @en
type: Concept