رمزنگاری
preferred label: cryptography @en
type: Concept
narrower: رمزنگاری دیداری

رمزنگاری دیداری
scope note: رمزنگاری اطلاعات بصری، اعم از تصویر و متن و جز آن، که برای رمزگشایی از آنها دستگاه بینایی انسان کفایت می‌کند و به رایانه نیازی نیست.
broader: رمزنگاری
preferred label: visual cryptography @en
type: Concept