آمپرولت‌سنجی چرخه‌ای کم‌دامنه
scope note: فنی برای اندازه‌گیری مقاومت به خوردگی و قطبش
broader: آمپرولت‌سنجی چرخه‌ای
preferred label: small-amplitude cycle voltammetry @en
type: Concept

آمپرولت‌سنجی چرخه‌ای
preferred label: cyclic voltammetry @en
type: Concept
narrower: آمپرولت‌سنجی چرخه‌ای کم‌دامنه