داده‌های رسته‌ای
scope note: داده‌های قابل‌تفکیک به رسته‌های دوبه‌دو مجزا
broader: داده
preferred label: categorical data @en
type: Concept

داده
preferred label: data @en
type: Concept
narrower: داده‌های رسته‌ای