داده‌های خوشه‌بندی‌شده
preferred label: clustered data @en
type: Concept
narrower: خوشه‌داده‌های ساده

خوشه‌داده‌های ساده
scope note: داده‌های خوشه‌بندی‌شدۀ همگن که کارکرد واحدی دارند.
broader: داده‌های خوشه‌بندی‌شده
preferred label: simple data cluster @en
type: Concept